{"text_format":"1","workbook":"xlsx","n_sheets":7,"sheets":["Project Information","Budget Information ES","Budget Information TH","Budget Information RRH","Budget Information PSH","HIC (hidden)","Drop Downs (hidden)"],"not_rendered":{"charts":0,"images":0,"macros":1,"external_links":0,"defined_names":10,"comments":0,"pivot_tables":0},"unopened":[],"bounds":{"document_bytes":16777216,"sheet_cells":100000,"rows_first":2000,"rows_last":500,"rows_between":2000,"halvings":0,"cell_chars":16384,"cell_head_chars":4096},"cells_cut":0,"cells_raw":0,"read":"whole","date_system":"1900"}

{"sheet":"Project Information","index":0,"n_rows":500,"n_cols":14,"rows_kept":500,"cut":false,"hidden":false,"merged":[]}
[null,null,null,null,"Select Provider Name from Drop Down in Yellow Cell",null,null,null,null,null,null,null,{"$f":"INDEX(B4:B200,MATCH(\"\",A4:A200,0))+2","v":3},"Last Row of Organization Names"]
[]
[null,null,"Provider Name",{"$f":"CONCATENATE(\"Project Name\n(from \",'HIC (hidden)'!U3,\" HIC or CoC)\")","v":"Project Name\n(from  HIC or CoC)"},"Project Type","Project Sub Type","Notes, Corrections, etc."]
[{"$f":"'Drop Downs (hidden)'!A3","v":""},1]
[{"$f":"'Drop Downs (hidden)'!A4","v":""},2]
[{"$f":"'Drop Downs (hidden)'!A5","v":""},3]
[{"$f":"'Drop Downs (hidden)'!A6","v":""},4]
[{"$f":"'Drop Downs (hidden)'!A7","v":""},5]
[{"$f":"'Drop Downs (hidden)'!A8","v":""},6]
[{"$f":"'Drop Downs (hidden)'!A9","v":""},7]
[{"$f":"'Drop Downs (hidden)'!A10","v":""},8]
[{"$f":"'Drop Downs (hidden)'!A11","v":""},9]
[{"$f":"'Drop Downs (hidden)'!A12","v":""},10]
[{"$f":"'Drop Downs (hidden)'!A13","v":""},11]
[{"$f":"'Drop Downs (hidden)'!A14","v":""},12]
[{"$f":"'Drop Downs (hidden)'!A15","v":""},13]
[{"$f":"'Drop Downs (hidden)'!A16","v":""},14]
[{"$f":"'Drop Downs (hidden)'!A17","v":""},15]
[{"$f":"'Drop Downs (hidden)'!A18","v":""},16]
[{"$f":"'Drop Downs (hidden)'!A19","v":""},17]
[{"$f":"'Drop Downs (hidden)'!A20","v":""},18]
[{"$f":"'Drop Downs (hidden)'!A21","v":""},19]
[{"$f":"'Drop Downs (hidden)'!A22","v":""},20,null,null,null,null,null,null,null,null,null,null,""]
[{"$f":"'Drop Downs (hidden)'!A23","v":""},21,null,null,null,null,null,null,null,null,null,null,""]
[{"$f":"'Drop Downs (hidden)'!A24","v":""},22,null,null,null,null,null,null,null,null,null,null,""]
[{"$f":"'Drop Downs (hidden)'!A25","v":""},23,null,null,null,null,null,null,null,null,null,null,""]
[{"$f":"'Drop Downs (hidden)'!A26","v":""},24,null,null,null,null,null,null,null,null,null,null,""]
[{"$f":"'Drop Downs (hidden)'!A27","v":""},25,null,null,null,null,null,null,null,null,null,null,""]
[{"$f":"'Drop Downs (hidden)'!A28","v":""},26,null,null,null,null,null,null,null,null,null,null,""]
[{"$f":"'Drop Downs (hidden)'!A29","v":""},27,null,null,null,null,null,null,null,null,null,null,""]
[{"$f":"'Drop Downs (hidden)'!A30","v":""},28,null,null,null,null,null,null,null,null,null,null,""]
[{"$f":"'Drop Downs (hidden)'!A31","v":""},29,null,null,null,null,null,null,null,null,null,null,""]
[{"$f":"'Drop Downs (hidden)'!A32","v":""},30,null,null,null,null,null,null,null,null,null,null,""]
[{"$f":"'Drop Downs (hidden)'!A33","v":""},31,null,null,null,null,null,null,null,null,null,null,""]
[{"$f":"'Drop Downs (hidden)'!A34","v":""},32,null,null,null,null,null,null,null,null,null,null,""]
[{"$f":"'Drop Downs (hidden)'!A35","v":""},33,null,null,null,null,null,null,null,null,null,null,""]
[{"$f":"'Drop Downs (hidden)'!A36","v":""},34,null,null,null,null,null,null,null,null,null,null,""]
[{"$f":"'Drop Downs (hidden)'!A37","v":""},35,null,null,null,null,null,null,null,null,null,null,""]
[{"$f":"'Drop Downs (hidden)'!A38","v":""},36,null,null,null,null,null,null,null,null,null,null,""]
[{"$f":"'Drop Downs (hidden)'!A39","v":""},37,null,null,null,null,null,null,null,null,null,null,""]
{"$rows_left_out":461}
{"sheet":"Budget Information ES","index":1,"n_rows":2,"n_cols":14,"rows_kept":2,"cut":false,"hidden":false,"merged":[[0,3,0,7]]}
[null,null,null,"Capacity"]
["Provider Name","Project Name\n(from HIC or CoC)","Project Type","Adult Only Beds","Family Units","Child Only Beds","Seasonal Beds","Overflow Beds","Total Project Budget","HUD CoC Grant","HUD ESG Grant","Other Public Funds","Private Funds","Notes, Corrections, etc."]

{"sheet":"Budget Information TH","index":2,"n_rows":2,"n_cols":11,"rows_kept":2,"cut":false,"hidden":false,"merged":[[0,3,0,5]]}
[null,null,null,"Capacity"]
["Provider Name","Project Name\n(from HIC or CoC)","Project Type","Adult Only Beds","Family Units","Child Only Beds","Total Project Budget","HUD CoC Grant","Other Public Funds","Private Funds","Notes, Corrections, etc."]

{"sheet":"Budget Information RRH","index":3,"n_rows":2,"n_cols":14,"rows_kept":2,"cut":false,"hidden":false,"merged":[[0,3,0,4]]}
[null,null,null,"Capacity "]
["Provider Name","Project Name\n(from HIC or CoC)","Project Type","Adult Only Beds","Family Units","Total Project Budget","HUD CoC Grant","HUD ESG Grant","Other Public Funds","Private Funds","What is included in this budget? ","Who should provide the services portion of the budget?","Who should provide the rental assistance portion of the budget?","Notes, Corrections, etc."]

{"sheet":"Budget Information PSH","index":4,"n_rows":2,"n_cols":13,"rows_kept":2,"cut":false,"hidden":false,"merged":[[0,3,0,4]]}
[null,null,null,"Capacity "]
["Provider Name","Project Name\n(from HIC or CoC)","Project Type","Adult Only Beds","Family Units","Total Project Budget","HUD CoC Grant","Other Public Funds","Private Funds","What is included in this budget? ","Who should provide the services portion of the budget?","Who should provide the housing/rental assistance portion of the budget?","Notes, Corrections, etc."]

{"sheet":"HIC (hidden)","index":5,"n_rows":466,"n_cols":21,"rows_kept":466,"cut":false,"hidden":false,"merged":[[0,0,0,9]]}
["INSTRUCTIONS: Extract your most recent HIC from HDX into Excel and remove any project(s) not included in the budget analysis.  Paying attention to the grey column headers in row 2, organize the HIC in Excel to align with the columns included below.  Remove any \"total\" rows. Sort the HIC in alphabetical order by name of Organization. Paste the HIC data below \"as values.\"  Be sure to carefully follow the order of column headers.  Be sure that each project name in the HIC is unique (i.e. there are not two projects operated by two different providers with the same name). Additionally, ensure that the \"Proj. Type\" is one of the following five types: ES, TH, PSH, or RRH.  The HIC may have addtional project types (OPH/SH) which should be coded as PSH/ES or TH - please re-code these appropriately before inputting in this template. (This workbook will accommodate up to 200 projects)"]
["Proj. Type","Organization Name","Project Name","Beds HH w/ Children","Units HH w/ Children","Beds HH w/o Children","Beds HH w/ only Children","CH Beds","Veteran Beds","Youth Beds","Year-Round Beds","Total Seasonal Beds","Total Overflow Beds","PIT Count","Total Beds","Utilization Rate",null,"Project # of Provider",null,null,"HIC YEAR"]
[null,null,null,null,null,null,null,null,null,null,null,null,null,null,null,null,null,{"$f":"IF(B3=\"\",\"\",IF(B3=B2,R2+1,1))","v":""}]
[null,null,null,null,null,null,null,null,null,null,null,null,null,null,null,null,null,{"$f":"IF(B4=\"\",\"\",IF(B4=B3,R3+1,1))","v":""}]
[null,null,null,null,null,null,null,null,null,null,null,null,null,null,null,null,null,""]
[null,null,null,null,null,null,null,null,null,null,null,null,null,null,null,null,null,""]
[null,null,null,null,null,null,null,null,null,null,null,null,null,null,null,null,null,""]
[null,null,null,null,null,null,null,null,null,null,null,null,null,null,null,null,null,""]
[null,null,null,null,null,null,null,null,null,null,null,null,null,null,null,null,null,""]
[null,null,null,null,null,null,null,null,null,null,null,null,null,null,null,null,null,""]
[null,null,null,null,null,null,null,null,null,null,null,null,null,null,null,null,null,""]
[null,null,null,null,null,null,null,null,null,null,null,null,null,null,null,null,null,""]
[null,null,null,null,null,null,null,null,null,null,null,null,null,null,null,null,null,""]
[null,null,null,null,null,null,null,null,null,null,null,null,null,null,null,null,null,""]
[null,null,null,null,null,null,null,null,null,null,null,null,null,null,null,null,null,""]
[null,null,null,null,null,null,null,null,null,null,null,null,null,null,null,null,null,""]
[null,null,null,null,null,null,null,null,null,null,null,null,null,null,null,null,null,""]
[null,null,null,null,null,null,null,null,null,null,null,null,null,null,null,null,null,""]
[null,null,null,null,null,null,null,null,null,null,null,null,null,null,null,null,null,""]
[null,null,null,null,null,null,null,null,null,null,null,null,null,null,null,null,null,""]
[null,null,null,null,null,null,null,null,null,null,null,null,null,null,null,null,null,""]
[null,null,null,null,null,null,null,null,null,null,null,null,null,null,null,null,null,""]
[null,null,null,null,null,null,null,null,null,null,null,null,null,null,null,null,null,""]
[null,null,null,null,null,null,null,null,null,null,null,null,null,null,null,null,null,""]
[null,null,null,null,null,null,null,null,null,null,null,null,null,null,null,null,null,""]
[null,null,null,null,null,null,null,null,null,null,null,null,null,null,null,null,null,""]
[null,null,null,null,null,null,null,null,null,null,null,null,null,null,null,null,null,""]
[null,null,null,null,null,null,null,null,null,null,null,null,null,null,null,null,null,""]
[null,null,null,null,null,null,null,null,null,null,null,null,null,null,null,null,null,""]
[null,null,null,null,null,null,null,null,null,null,null,null,null,null,null,null,null,""]
[null,null,null,null,null,null,null,null,null,null,null,null,null,null,null,null,null,""]
[null,null,null,null,null,null,null,null,null,null,null,null,null,null,null,null,null,""]
[null,null,null,null,null,null,null,null,null,null,null,null,null,null,null,null,null,""]
[null,null,null,null,null,null,null,null,null,null,null,null,null,null,null,null,null,""]
[null,null,null,null,null,null,null,null,null,null,null,null,null,null,null,null,null,""]
[null,null,null,null,null,null,null,null,null,null,null,null,null,null,null,null,null,""]
[null,null,null,null,null,null,null,null,null,null,null,null,null,null,null,null,null,""]
[null,null,null,null,null,null,null,null,null,null,null,null,null,null,null,null,null,""]
[null,null,null,null,null,null,null,null,null,null,null,null,null,null,null,null,null,""]
[null,null,null,null,null,null,null,null,null,null,null,null,null,null,null,null,null,""]
{"$rows_left_out":427}
{"sheet":"Drop Downs (hidden)","index":6,"n_rows":500,"n_cols":11,"rows_kept":500,"cut":false,"hidden":true,"merged":[]}
[]
["Providers","Number of Projects",null,"Project Type","Associated Subtype(s)",null,"PSH","Budget",null,"RRH","Budget"]
[{"$f":"IF('HIC (hidden)'!A3=\"\",\"\",'HIC (hidden)'!B3)","v":""},{"$f":"IF(A3=\"\",\"\",COUNTIF('HIC (hidden)'!B:B,'Drop Downs (hidden)'!A3))","v":""},null,"ES","Congregate/Dormitory",null,null,"Services Only",null,null,"Single Adult Households"]
[{"$f":"IFERROR(IF(INDEX('HIC (hidden)'!$B$3:$B$499,MATCH(0,COUNTIF('Drop Downs (hidden)'!$A$3:A3,'HIC (hidden)'!$B$3:$B$499),0))=0,\"\",INDEX('HIC (hidden)'!$B$3:$B$499,MATCH(0,COUNTIF('Drop Downs (hidden)'!$A$3:A3,'HIC (hidden)'!$B$3:$B$499),0))),\"\")","v":""},{"$f":"IF(A4=\"\",\"\",COUNTIF('HIC (hidden)'!B:B,'Drop Downs (hidden)'!A4))","v":""},null,"ES","Separate Units",null,null,"Rental Assistance Only",null,null,"Family Households"]
[{"$f":"IFERROR(IF(INDEX('HIC (hidden)'!$B$3:$B$499,MATCH(0,COUNTIF('Drop Downs (hidden)'!$A$3:A4,'HIC (hidden)'!$B$3:$B$499),0))=0,\"\",INDEX('HIC (hidden)'!$B$3:$B$499,MATCH(0,COUNTIF('Drop Downs (hidden)'!$A$3:A4,'HIC (hidden)'!$B$3:$B$499),0))),\"\")","v":""},{"$f":"IF(A5=\"\",\"\",COUNTIF('HIC (hidden)'!B:B,'Drop Downs (hidden)'!A5))","v":""},null,"ES","Hotel/Motel Vouchers",null,null,"Services and Rental Assistance",null,null,"Both Single Adult and Family Households"]
[{"$f":"IFERROR(IF(INDEX('HIC (hidden)'!$B$3:$B$499,MATCH(0,COUNTIF('Drop Downs (hidden)'!$A$3:A5,'HIC (hidden)'!$B$3:$B$499),0))=0,\"\",INDEX('HIC (hidden)'!$B$3:$B$499,MATCH(0,COUNTIF('Drop Downs (hidden)'!$A$3:A5,'HIC (hidden)'!$B$3:$B$499),0))),\"\")","v":""},{"$f":"IF(A6=\"\",\"\",COUNTIF('HIC (hidden)'!B:B,'Drop Downs (hidden)'!A6))","v":""},null,"SH","Congregate/Dormitory"]
[{"$f":"IFERROR(IF(INDEX('HIC (hidden)'!$B$3:$B$499,MATCH(0,COUNTIF('Drop Downs (hidden)'!$A$3:A6,'HIC (hidden)'!$B$3:$B$499),0))=0,\"\",INDEX('HIC (hidden)'!$B$3:$B$499,MATCH(0,COUNTIF('Drop Downs (hidden)'!$A$3:A6,'HIC (hidden)'!$B$3:$B$499),0))),\"\")","v":""},{"$f":"IF(A7=\"\",\"\",COUNTIF('HIC (hidden)'!B:B,'Drop Downs (hidden)'!A7))","v":""},null,"SH","Separate Units",null,null,"Services Only",null,null,"Services Only"]
[{"$f":"IFERROR(IF(INDEX('HIC (hidden)'!$B$3:$B$499,MATCH(0,COUNTIF('Drop Downs (hidden)'!$A$3:A7,'HIC (hidden)'!$B$3:$B$499),0))=0,\"\",INDEX('HIC (hidden)'!$B$3:$B$499,MATCH(0,COUNTIF('Drop Downs (hidden)'!$A$3:A7,'HIC (hidden)'!$B$3:$B$499),0))),\"\")","v":""},{"$f":"IF(A8=\"\",\"\",COUNTIF('HIC (hidden)'!B:B,'Drop Downs (hidden)'!A8))","v":""},null,"SH","Hotel/Motel Vouchers",null,null,"Housing/Rental Assistance Only",null,null,"Rental Assistance Only"]
[{"$f":"IFERROR(IF(INDEX('HIC (hidden)'!$B$3:$B$499,MATCH(0,COUNTIF('Drop Downs (hidden)'!$A$3:A8,'HIC (hidden)'!$B$3:$B$499),0))=0,\"\",INDEX('HIC (hidden)'!$B$3:$B$499,MATCH(0,COUNTIF('Drop Downs (hidden)'!$A$3:A8,'HIC (hidden)'!$B$3:$B$499),0))),\"\")","v":""},{"$f":"IF(A9=\"\",\"\",COUNTIF('HIC (hidden)'!B:B,'Drop Downs (hidden)'!A9))","v":""},null,"TH","Single Site Congregate",null,null,"All Services and Rental Assistance",null,null,"All Services and Rental Assistance"]
[{"$f":"IFERROR(IF(INDEX('HIC (hidden)'!$B$3:$B$499,MATCH(0,COUNTIF('Drop Downs (hidden)'!$A$3:A9,'HIC (hidden)'!$B$3:$B$499),0))=0,\"\",INDEX('HIC (hidden)'!$B$3:$B$499,MATCH(0,COUNTIF('Drop Downs (hidden)'!$A$3:A9,'HIC (hidden)'!$B$3:$B$499),0))),\"\")","v":""},{"$f":"IF(A10=\"\",\"\",COUNTIF('HIC (hidden)'!B:B,'Drop Downs (hidden)'!A10))","v":""},null,"TH","Single Site Separate Units"]
[{"$f":"IFERROR(IF(INDEX('HIC (hidden)'!$B$3:$B$499,MATCH(0,COUNTIF('Drop Downs (hidden)'!$A$3:A10,'HIC (hidden)'!$B$3:$B$499),0))=0,\"\",INDEX('HIC (hidden)'!$B$3:$B$499,MATCH(0,COUNTIF('Drop Downs (hidden)'!$A$3:A10,'HIC (hidden)'!$B$3:$B$499),0))),\"\")","v":""},{"$f":"IF(A11=\"\",\"\",COUNTIF('HIC (hidden)'!B:B,'Drop Downs (hidden)'!A11))","v":""},null,"TH","Scattered Site"]
[{"$f":"IFERROR(IF(INDEX('HIC (hidden)'!$B$3:$B$499,MATCH(0,COUNTIF('Drop Downs (hidden)'!$A$3:A11,'HIC (hidden)'!$B$3:$B$499),0))=0,\"\",INDEX('HIC (hidden)'!$B$3:$B$499,MATCH(0,COUNTIF('Drop Downs (hidden)'!$A$3:A11,'HIC (hidden)'!$B$3:$B$499),0))),\"\")","v":""},{"$f":"IF(A12=\"\",\"\",COUNTIF('HIC (hidden)'!B:B,'Drop Downs (hidden)'!A12))","v":""},null,"TH","Scattered Site, Transition in Place"]
[{"$f":"IFERROR(IF(INDEX('HIC (hidden)'!$B$3:$B$499,MATCH(0,COUNTIF('Drop Downs (hidden)'!$A$3:A12,'HIC (hidden)'!$B$3:$B$499),0))=0,\"\",INDEX('HIC (hidden)'!$B$3:$B$499,MATCH(0,COUNTIF('Drop Downs (hidden)'!$A$3:A12,'HIC (hidden)'!$B$3:$B$499),0))),\"\")","v":""},{"$f":"IF(A13=\"\",\"\",COUNTIF('HIC (hidden)'!B:B,'Drop Downs (hidden)'!A13))","v":""},null,"TH","Other (explain in notes)"]
[{"$f":"IFERROR(IF(INDEX('HIC (hidden)'!$B$3:$B$499,MATCH(0,COUNTIF('Drop Downs (hidden)'!$A$3:A13,'HIC (hidden)'!$B$3:$B$499),0))=0,\"\",INDEX('HIC (hidden)'!$B$3:$B$499,MATCH(0,COUNTIF('Drop Downs (hidden)'!$A$3:A13,'HIC (hidden)'!$B$3:$B$499),0))),\"\")","v":""},{"$f":"IF(A14=\"\",\"\",COUNTIF('HIC (hidden)'!B:B,'Drop Downs (hidden)'!A14))","v":""},null,"PSH","Single Site"]
[{"$f":"IFERROR(IF(INDEX('HIC (hidden)'!$B$3:$B$499,MATCH(0,COUNTIF('Drop Downs (hidden)'!$A$3:A14,'HIC (hidden)'!$B$3:$B$499),0))=0,\"\",INDEX('HIC (hidden)'!$B$3:$B$499,MATCH(0,COUNTIF('Drop Downs (hidden)'!$A$3:A14,'HIC (hidden)'!$B$3:$B$499),0))),\"\")","v":""},{"$f":"IF(A15=\"\",\"\",COUNTIF('HIC (hidden)'!B:B,'Drop Downs (hidden)'!A15))","v":""},null,"PSH","Scattered Site Leasing"]
[{"$f":"IFERROR(IF(INDEX('HIC (hidden)'!$B$3:$B$499,MATCH(0,COUNTIF('Drop Downs (hidden)'!$A$3:A15,'HIC (hidden)'!$B$3:$B$499),0))=0,\"\",INDEX('HIC (hidden)'!$B$3:$B$499,MATCH(0,COUNTIF('Drop Downs (hidden)'!$A$3:A15,'HIC (hidden)'!$B$3:$B$499),0))),\"\")","v":""},{"$f":"IF(A16=\"\",\"\",COUNTIF('HIC (hidden)'!B:B,'Drop Downs (hidden)'!A16))","v":""},null,"PSH","Scattered Site Owned Units"]
[{"$f":"IFERROR(IF(INDEX('HIC (hidden)'!$B$3:$B$499,MATCH(0,COUNTIF('Drop Downs (hidden)'!$A$3:A16,'HIC (hidden)'!$B$3:$B$499),0))=0,\"\",INDEX('HIC (hidden)'!$B$3:$B$499,MATCH(0,COUNTIF('Drop Downs (hidden)'!$A$3:A16,'HIC (hidden)'!$B$3:$B$499),0))),\"\")","v":""},{"$f":"IF(A17=\"\",\"\",COUNTIF('HIC (hidden)'!B:B,'Drop Downs (hidden)'!A17))","v":""},null,"RRH","N/A"]
[{"$f":"IFERROR(IF(INDEX('HIC (hidden)'!$B$3:$B$499,MATCH(0,COUNTIF('Drop Downs (hidden)'!$A$3:A17,'HIC (hidden)'!$B$3:$B$499),0))=0,\"\",INDEX('HIC (hidden)'!$B$3:$B$499,MATCH(0,COUNTIF('Drop Downs (hidden)'!$A$3:A17,'HIC (hidden)'!$B$3:$B$499),0))),\"\")","v":""},{"$f":"IF(A18=\"\",\"\",COUNTIF('HIC (hidden)'!B:B,'Drop Downs (hidden)'!A18))","v":""}]
[{"$f":"IFERROR(IF(INDEX('HIC (hidden)'!$B$3:$B$499,MATCH(0,COUNTIF('Drop Downs (hidden)'!$A$3:A18,'HIC (hidden)'!$B$3:$B$499),0))=0,\"\",INDEX('HIC (hidden)'!$B$3:$B$499,MATCH(0,COUNTIF('Drop Downs (hidden)'!$A$3:A18,'HIC (hidden)'!$B$3:$B$499),0))),\"\")","v":""},{"$f":"IF(A19=\"\",\"\",COUNTIF('HIC (hidden)'!B:B,'Drop Downs (hidden)'!A19))","v":""}]
[{"$f":"IFERROR(IF(INDEX('HIC (hidden)'!$B$3:$B$499,MATCH(0,COUNTIF('Drop Downs (hidden)'!$A$3:A19,'HIC (hidden)'!$B$3:$B$499),0))=0,\"\",INDEX('HIC (hidden)'!$B$3:$B$499,MATCH(0,COUNTIF('Drop Downs (hidden)'!$A$3:A19,'HIC (hidden)'!$B$3:$B$499),0))),\"\")","v":""},{"$f":"IF(A20=\"\",\"\",COUNTIF('HIC (hidden)'!B:B,'Drop Downs (hidden)'!A20))","v":""}]
[{"$f":"IFERROR(IF(INDEX('HIC (hidden)'!$B$3:$B$499,MATCH(0,COUNTIF('Drop Downs (hidden)'!$A$3:A20,'HIC (hidden)'!$B$3:$B$499),0))=0,\"\",INDEX('HIC (hidden)'!$B$3:$B$499,MATCH(0,COUNTIF('Drop Downs (hidden)'!$A$3:A20,'HIC (hidden)'!$B$3:$B$499),0))),\"\")","v":""},{"$f":"IF(A21=\"\",\"\",COUNTIF('HIC (hidden)'!B:B,'Drop Downs (hidden)'!A21))","v":""}]
[{"$f":"IFERROR(IF(INDEX('HIC (hidden)'!$B$3:$B$499,MATCH(0,COUNTIF('Drop Downs (hidden)'!$A$3:A21,'HIC (hidden)'!$B$3:$B$499),0))=0,\"\",INDEX('HIC (hidden)'!$B$3:$B$499,MATCH(0,COUNTIF('Drop Downs (hidden)'!$A$3:A21,'HIC (hidden)'!$B$3:$B$499),0))),\"\")","v":""},{"$f":"IF(A22=\"\",\"\",COUNTIF('HIC (hidden)'!B:B,'Drop Downs (hidden)'!A22))","v":""}]
[{"$f":"IFERROR(IF(INDEX('HIC (hidden)'!$B$3:$B$499,MATCH(0,COUNTIF('Drop Downs (hidden)'!$A$3:A22,'HIC (hidden)'!$B$3:$B$499),0))=0,\"\",INDEX('HIC (hidden)'!$B$3:$B$499,MATCH(0,COUNTIF('Drop Downs (hidden)'!$A$3:A22,'HIC (hidden)'!$B$3:$B$499),0))),\"\")","v":""},{"$f":"IF(A23=\"\",\"\",COUNTIF('HIC (hidden)'!B:B,'Drop Downs (hidden)'!A23))","v":""}]
[{"$f":"IFERROR(IF(INDEX('HIC (hidden)'!$B$3:$B$499,MATCH(0,COUNTIF('Drop Downs (hidden)'!$A$3:A23,'HIC (hidden)'!$B$3:$B$499),0))=0,\"\",INDEX('HIC (hidden)'!$B$3:$B$499,MATCH(0,COUNTIF('Drop Downs (hidden)'!$A$3:A23,'HIC (hidden)'!$B$3:$B$499),0))),\"\")","v":""},{"$f":"IF(A24=\"\",\"\",COUNTIF('HIC (hidden)'!B:B,'Drop Downs (hidden)'!A24))","v":""}]
[{"$f":"IFERROR(IF(INDEX('HIC (hidden)'!$B$3:$B$499,MATCH(0,COUNTIF('Drop Downs (hidden)'!$A$3:A24,'HIC (hidden)'!$B$3:$B$499),0))=0,\"\",INDEX('HIC (hidden)'!$B$3:$B$499,MATCH(0,COUNTIF('Drop Downs (hidden)'!$A$3:A24,'HIC (hidden)'!$B$3:$B$499),0))),\"\")","v":""},{"$f":"IF(A25=\"\",\"\",COUNTIF('HIC (hidden)'!B:B,'Drop Downs (hidden)'!A25))","v":""}]
[{"$f":"IFERROR(IF(INDEX('HIC (hidden)'!$B$3:$B$499,MATCH(0,COUNTIF('Drop Downs (hidden)'!$A$3:A25,'HIC (hidden)'!$B$3:$B$499),0))=0,\"\",INDEX('HIC (hidden)'!$B$3:$B$499,MATCH(0,COUNTIF('Drop Downs (hidden)'!$A$3:A25,'HIC (hidden)'!$B$3:$B$499),0))),\"\")","v":""},{"$f":"IF(A26=\"\",\"\",COUNTIF('HIC (hidden)'!B:B,'Drop Downs (hidden)'!A26))","v":""}]
[{"$f":"IFERROR(IF(INDEX('HIC (hidden)'!$B$3:$B$499,MATCH(0,COUNTIF('Drop Downs (hidden)'!$A$3:A26,'HIC (hidden)'!$B$3:$B$499),0))=0,\"\",INDEX('HIC (hidden)'!$B$3:$B$499,MATCH(0,COUNTIF('Drop Downs (hidden)'!$A$3:A26,'HIC (hidden)'!$B$3:$B$499),0))),\"\")","v":""},{"$f":"IF(A27=\"\",\"\",COUNTIF('HIC (hidden)'!B:B,'Drop Downs (hidden)'!A27))","v":""}]
[{"$f":"IFERROR(IF(INDEX('HIC (hidden)'!$B$3:$B$499,MATCH(0,COUNTIF('Drop Downs (hidden)'!$A$3:A27,'HIC (hidden)'!$B$3:$B$499),0))=0,\"\",INDEX('HIC (hidden)'!$B$3:$B$499,MATCH(0,COUNTIF('Drop Downs (hidden)'!$A$3:A27,'HIC (hidden)'!$B$3:$B$499),0))),\"\")","v":""},{"$f":"IF(A28=\"\",\"\",COUNTIF('HIC (hidden)'!B:B,'Drop Downs (hidden)'!A28))","v":""}]
[{"$f":"IFERROR(IF(INDEX('HIC (hidden)'!$B$3:$B$499,MATCH(0,COUNTIF('Drop Downs (hidden)'!$A$3:A28,'HIC (hidden)'!$B$3:$B$499),0))=0,\"\",INDEX('HIC (hidden)'!$B$3:$B$499,MATCH(0,COUNTIF('Drop Downs (hidden)'!$A$3:A28,'HIC (hidden)'!$B$3:$B$499),0))),\"\")","v":""},{"$f":"IF(A29=\"\",\"\",COUNTIF('HIC (hidden)'!B:B,'Drop Downs (hidden)'!A29))","v":""}]
[{"$f":"IFERROR(IF(INDEX('HIC (hidden)'!$B$3:$B$499,MATCH(0,COUNTIF('Drop Downs (hidden)'!$A$3:A29,'HIC (hidden)'!$B$3:$B$499),0))=0,\"\",INDEX('HIC (hidden)'!$B$3:$B$499,MATCH(0,COUNTIF('Drop Downs (hidden)'!$A$3:A29,'HIC (hidden)'!$B$3:$B$499),0))),\"\")","v":""},{"$f":"IF(A30=\"\",\"\",COUNTIF('HIC (hidden)'!B:B,'Drop Downs (hidden)'!A30))","v":""}]
[{"$f":"IFERROR(IF(INDEX('HIC (hidden)'!$B$3:$B$499,MATCH(0,COUNTIF('Drop Downs (hidden)'!$A$3:A30,'HIC (hidden)'!$B$3:$B$499),0))=0,\"\",INDEX('HIC (hidden)'!$B$3:$B$499,MATCH(0,COUNTIF('Drop Downs (hidden)'!$A$3:A30,'HIC (hidden)'!$B$3:$B$499),0))),\"\")","v":""},{"$f":"IF(A31=\"\",\"\",COUNTIF('HIC (hidden)'!B:B,'Drop Downs (hidden)'!A31))","v":""}]
[{"$f":"IFERROR(IF(INDEX('HIC (hidden)'!$B$3:$B$499,MATCH(0,COUNTIF('Drop Downs (hidden)'!$A$3:A31,'HIC (hidden)'!$B$3:$B$499),0))=0,\"\",INDEX('HIC (hidden)'!$B$3:$B$499,MATCH(0,COUNTIF('Drop Downs (hidden)'!$A$3:A31,'HIC (hidden)'!$B$3:$B$499),0))),\"\")","v":""},{"$f":"IF(A32=\"\",\"\",COUNTIF('HIC (hidden)'!B:B,'Drop Downs (hidden)'!A32))","v":""}]
[{"$f":"IFERROR(IF(INDEX('HIC (hidden)'!$B$3:$B$499,MATCH(0,COUNTIF('Drop Downs (hidden)'!$A$3:A32,'HIC (hidden)'!$B$3:$B$499),0))=0,\"\",INDEX('HIC (hidden)'!$B$3:$B$499,MATCH(0,COUNTIF('Drop Downs (hidden)'!$A$3:A32,'HIC (hidden)'!$B$3:$B$499),0))),\"\")","v":""},{"$f":"IF(A33=\"\",\"\",COUNTIF('HIC (hidden)'!B:B,'Drop Downs (hidden)'!A33))","v":""}]
[{"$f":"IFERROR(IF(INDEX('HIC (hidden)'!$B$3:$B$499,MATCH(0,COUNTIF('Drop Downs (hidden)'!$A$3:A33,'HIC (hidden)'!$B$3:$B$499),0))=0,\"\",INDEX('HIC (hidden)'!$B$3:$B$499,MATCH(0,COUNTIF('Drop Downs (hidden)'!$A$3:A33,'HIC (hidden)'!$B$3:$B$499),0))),\"\")","v":""},{"$f":"IF(A34=\"\",\"\",COUNTIF('HIC (hidden)'!B:B,'Drop Downs (hidden)'!A34))","v":""}]
[{"$f":"IFERROR(IF(INDEX('HIC (hidden)'!$B$3:$B$499,MATCH(0,COUNTIF('Drop Downs (hidden)'!$A$3:A34,'HIC (hidden)'!$B$3:$B$499),0))=0,\"\",INDEX('HIC (hidden)'!$B$3:$B$499,MATCH(0,COUNTIF('Drop Downs (hidden)'!$A$3:A34,'HIC (hidden)'!$B$3:$B$499),0))),\"\")","v":""},{"$f":"IF(A35=\"\",\"\",COUNTIF('HIC (hidden)'!B:B,'Drop Downs (hidden)'!A35))","v":""}]
[{"$f":"IFERROR(IF(INDEX('HIC (hidden)'!$B$3:$B$499,MATCH(0,COUNTIF('Drop Downs (hidden)'!$A$3:A35,'HIC (hidden)'!$B$3:$B$499),0))=0,\"\",INDEX('HIC (hidden)'!$B$3:$B$499,MATCH(0,COUNTIF('Drop Downs (hidden)'!$A$3:A35,'HIC (hidden)'!$B$3:$B$499),0))),\"\")","v":""},{"$f":"IF(A36=\"\",\"\",COUNTIF('HIC (hidden)'!B:B,'Drop Downs (hidden)'!A36))","v":""}]
[{"$f":"IFERROR(IF(INDEX('HIC (hidden)'!$B$3:$B$499,MATCH(0,COUNTIF('Drop Downs (hidden)'!$A$3:A36,'HIC (hidden)'!$B$3:$B$499),0))=0,\"\",INDEX('HIC (hidden)'!$B$3:$B$499,MATCH(0,COUNTIF('Drop Downs (hidden)'!$A$3:A36,'HIC (hidden)'!$B$3:$B$499),0))),\"\")","v":""},{"$f":"IF(A37=\"\",\"\",COUNTIF('HIC (hidden)'!B:B,'Drop Downs (hidden)'!A37))","v":""}]
[{"$f":"IFERROR(IF(INDEX('HIC (hidden)'!$B$3:$B$499,MATCH(0,COUNTIF('Drop Downs (hidden)'!$A$3:A37,'HIC (hidden)'!$B$3:$B$499),0))=0,\"\",INDEX('HIC (hidden)'!$B$3:$B$499,MATCH(0,COUNTIF('Drop Downs (hidden)'!$A$3:A37,'HIC (hidden)'!$B$3:$B$499),0))),\"\")","v":""},{"$f":"IF(A38=\"\",\"\",COUNTIF('HIC (hidden)'!B:B,'Drop Downs (hidden)'!A38))","v":""}]
[{"$f":"IFERROR(IF(INDEX('HIC (hidden)'!$B$3:$B$499,MATCH(0,COUNTIF('Drop Downs (hidden)'!$A$3:A38,'HIC (hidden)'!$B$3:$B$499),0))=0,\"\",INDEX('HIC (hidden)'!$B$3:$B$499,MATCH(0,COUNTIF('Drop Downs (hidden)'!$A$3:A38,'HIC (hidden)'!$B$3:$B$499),0))),\"\")","v":""},{"$f":"IF(A39=\"\",\"\",COUNTIF('HIC (hidden)'!B:B,'Drop Downs (hidden)'!A39))","v":""}]
[{"$f":"IFERROR(IF(INDEX('HIC (hidden)'!$B$3:$B$499,MATCH(0,COUNTIF('Drop Downs (hidden)'!$A$3:A39,'HIC (hidden)'!$B$3:$B$499),0))=0,\"\",INDEX('HIC (hidden)'!$B$3:$B$499,MATCH(0,COUNTIF('Drop Downs (hidden)'!$A$3:A39,'HIC (hidden)'!$B$3:$B$499),0))),\"\")","v":""},{"$f":"IF(A40=\"\",\"\",COUNTIF('HIC (hidden)'!B:B,'Drop Downs (hidden)'!A40))","v":""}]
{"$rows_left_out":460}